{"text_format":"1","workbook":"xlsx","n_sheets":17,"sheets":["Parametres","Paramétrage des points","Comités","Juges","Clubs","BASE","pesée","FV","notes juge","résultat","résultat culturis form","C3","CULTURIS FORM","Couples","Résultat final","Résultats clubs","comparaison"],"not_rendered":{"charts":0,"images":5,"macros":1,"external_links":0,"defined_names":34,"comments":3,"pivot_tables":1},"unopened":[],"bounds":{"document_bytes":16777216,"sheet_cells":100000,"rows_first":2000,"rows_last":500,"rows_between":2000,"halvings":0,"cell_chars":16384,"cell_head_chars":4096},"cells_cut":0,"cells_raw":0,"read":"whole","date_system":"1900"}

{"sheet":"Parametres","index":0,"n_rows":27,"n_cols":9,"rows_kept":27,"cut":false,"hidden":false,"merged":[]}
["Paramètres de la compétition"]
[]
["Titre de la compétition :","Compétition magnifique"]
[]
["Type de compétition :","Nationale",{"$f":"VLOOKUP(B5,H5:I7,2,FALSE)","v":"N"},null,null,null,{"$f":"C5","v":"N"},"Régionale","R"]
[null,null,null,null,null,null,null,"Interzones","I"]
["Date de la compétition :","2013-03-13",null,null,null,null,null,"Nationale","N"]
[]
["Lieu de la compétition :","Gymnase c'est ici"]
[]
{"$rows_left_out":18}
{"sheet":"Paramétrage des points","index":1,"n_rows":142,"n_cols":28,"rows_kept":142,"cut":false,"hidden":false,"merged":[]}
["Paramètrage pour l'attribution des points"]
[]
["Catégories de la","Catégories de",null,null,null,"Les compétitions R(égionales) et I(nterzone) n'utilisent que ce tableau",null,null,null,null,null,null,null,null,null,null,null,null,null,null,null,"pts",null,null,null,"place",null,"pts"]
["compétition","Référence",null,null,null,null,"R","I",null,null,null,null,null,null,null,null,null,null,null,null,null,null,null,"N","HV",1,{"$f":"X4&Y4&Z4","v":"NHV1"},10]
[null,"HJ-75","JE",null,null,"HS",2,4,null,null,null,null,null,null,null,null,null,null,null,"R",{"$f":"T5&C5","v":"RJE"},6,null,"N","HV",2,{"$f":"X5&Y5&Z5","v":"NHV2"},8]
[null,"HJ+75","JE",null,null,"HV",2,4,null,null,null,null,null,null,null,null,null,null,null,"R",{"$f":"T6&C6","v":"RJE"},6,null,"N","HV",3,"NHV3",6]
[null,"FJ-75","JE",null,null,"FS",4,6,null,null,null,null,null,null,null,null,null,null,null,"R",{"$f":"T7&C7","v":"RJE"},6,null,"N","HV",4,"NHV4",4]
[null,"FJ+75","JE",null,null,"FV",4,6,null,null,null,null,null,null,null,null,null,null,null,"R","RJE",6,null,"N","HV",5,"NHV5",3]
[null,"HE-75","JE",null,null,"CUF",4,6,null,null,null,null,null,null,null,null,null,null,null,"R","RJE",6,null,"N","HV",6,"NHV6",2]
[null,"HE+75","JE",null,null,"JE ",6,8,null,null,null,null,null,null,null,null,null,null,null,"R","RJE",6,null,"N","HV",7,"NHV7",1]
{"$rows_left_out":133}
{"sheet":"Comités","index":2,"n_rows":28,"n_cols":3,"rows_kept":28,"cut":false,"hidden":false,"merged":[]}
["Comités régionaux","Départements","Zones"]
["ALSACE","67/68","ZONE NORD EST"]
["AQUITAINE","24 / 33 / 40 / 47 / 64","ZONE SUD OUEST"]
["AUVERGNE","03 / 15 / 43 / 63","ZONE SUD EST"]
["BASSE NORMANDIE","14 / 50 / 61","ZONE CENTRE OUEST"]
["BOURGOGNE","21/58/71/89","ZONE NORD EST"]
["BRETAGNE","22 / 29 / 35 / 56","ZONE CENTRE OUEST"]
["CENTRE","18 / 28 / 36 / 37 / 41 / 45","ZONE CENTRE OUEST"]
["CHAMPAGNE ARDENNES","08 / 10 / 51 / 52","ZONE NORD EST"]
["CORSE  / COTE D'AZUR","2A / 2B / 06 / 20 / 83","ZONE SUD EST"]
{"$rows_left_out":19}
{"sheet":"Juges","index":3,"n_rows":22,"n_cols":32,"rows_kept":22,"cut":false,"hidden":false,"merged":[]}
["NOM PRENOM","C1","C2","C3","C4","C5","CULTURIS FORM","Couples","FV",null,null,null,null,null,null,null,null,null,null,null,null,null,null,null,null,null,null,null,null,null,null,"Maximum 30 catégories par fichier Excel"]
["AA",1,2,1,1,1,5,1,null,2,3,2,2,2,3,null,null,3,4,1,1,1,3,3,2,5]
["BB",2,8,3,2,2,4,2,null,3,2,null,3,3,2,9,null,7,3,null,2,2,1,null,1,4]
["CC",3,3,2,null,3,3,3,null,4,4,3,4,4,4,null,5,5,5,2,3,3,5,null,4,3]
["DD",4,4,null,5,5,2,4,null,5,5,null,1,6,5,8,1,6,6,null,4,4,null,2,3,7]
["EE",5,5,null,3,4,null,5,3,null,6,null,null,5,7,null,4,1,7,3,5,5,null,1,5,2]
["FF",6,1,null,null,6,1,7,2,null,7,null,null,7,6,null,3,2,1,null,null,6,2,null,6,6]
["GG",7,9,null,4,7,null,6,1,1,1,1,5,1,1,7,2,4,2,null,null,7,4,null,7,1]
["HH",8,null,null,null,null,6,null,4,null,null,null,null,null,null,6,null,null,null,null,null,null,null,5]
["II",null,null,null,null,9,null,null,5,null,null,null,null,null,null,5]
{"$rows_left_out":13}
{"sheet":"Clubs","index":4,"n_rows":82,"n_cols":3,"rows_kept":82,"cut":false,"hidden":false,"merged":[]}
["CLUBS","COMITES","ZONES"]
["ACADEMIE CLUB LUCON","PAYS DE LOIRE",{"$f":"IFERROR(VLOOKUP(B2,Comités!A:C,3,FALSE),\"\")","v":"ZONE CENTRE OUEST"}]
["ACH FONTENAY","ILE DE FRANCE",{"$f":"IFERROR(VLOOKUP(B3,Comités!A:C,3,FALSE),\"\")","v":"ZONE NORD B"}]
["AFHMA FRANCONVILLE","ILE DE FRANCE",{"$f":"IFERROR(VLOOKUP(B4,Comités!A:C,3,FALSE),\"\")","v":"ZONE NORD B"}]
["AGOS INRIA","ILE DE FRANCE",{"$f":"IFERROR(VLOOKUP(B5,Comités!A:C,3,FALSE),\"\")","v":"ZONE NORD B"}]
["APOLLO CLUB TREMBLAY","ILE DE FRANCE",{"$f":"IFERROR(VLOOKUP(B6,Comités!A:C,3,FALSE),\"\")","v":"ZONE NORD B"}]
["AS FOURCHAMBAULT","BOURGOGNE",{"$f":"IFERROR(VLOOKUP(B7,Comités!A:C,3,FALSE),\"\")","v":"ZONE NORD EST"}]
["ASC MUSCLE GYM SOISSONS","PICARDIE",{"$f":"IFERROR(VLOOKUP(B8,Comités!A:C,3,FALSE),\"\")","v":"ZONE NORD A"}]
["ASCAP - POISSY","ILE DE FRANCE",{"$f":"IFERROR(VLOOKUP(B9,Comités!A:C,3,FALSE),\"\")","v":"ZONE NORD B"}]
["ASHC VILLIERS LE BEL","ILE DE FRANCE",{"$f":"IFERROR(VLOOKUP(B10,Comités!A:C,3,FALSE),\"\")","v":"ZONE NORD B"}]
{"$rows_left_out":73}
{"sheet":"BASE","index":5,"n_rows":201,"n_cols":19,"rows_kept":201,"cut":false,"hidden":false,"merged":[]}
["NOM","PRENOM","H/F","DATE-NAISSANCE","ÂGE (ANS)","ÂGE (J)","N° LICENCE","CLUB","COMITE","POIDS","CATEGORIE normale","CATEGORIE","N° DOSSARD","PLACE","POINTS"]
["MONCOURTOIS","CHRISTELLE","F","1960-11-20",{"$f":"IF(ISBLANK(A2),\"\",DATEDIF(D2,saison,\"y\"))","v":51},{"$f":"IF(ISBLANK($A2),\"\",IF(ISERROR(DATEDIF($D2,saison,\"yd\")),\"\",(DATEDIF($D2,saison,\"yd\"))))","v":285},141090,"ASC MUSCLE GYM SOISSONS",{"$f":"IF(A2=\"\",\"\",VLOOKUP(H2,Clubs!A:B,2,FALSE))","v":"PICARDIE"},52.5,{"$f":"IF(E2=\"\",\"\",IF(E2<16,\"ERREUR\",IF(AND(E2<18,C2=\"F\"),\"CF\",IF(E2<21,\"JUNIOR\", IF(E2<23,IF(C2=\"F\",\"SENIOR\",\"ESPOIR\"),IF(E2<40,\"SENIOR\",IF(C2=\"F\",\"VETERAN\",IF(E2<50,\"VET1\",IF(E2<60,\"VET2\",\"VET3\")))))))))","v":"VETERAN"},"Couples",1,{"$f":"IFERROR(VLOOKUP((P2&L2),'Résultat final'!A:B,2,FALSE),\"\")","v":1},{"$f":"SUM(R2:S2)","v":0},{"$f":"A2&\"  \"&B2","v":"MONCOURTOIS  CHRISTELLE"},{"$f":"IFERROR(HLOOKUP(L2,Juges!$1:$22,22,FALSE),\"\")","v":"NCH/CF"},{"$f":"+IF(OR(LEFT($Q2,1)=\"I\",LEFT($Q2,1)=\"R\"),VLOOKUP($Q2,'Paramétrage des points'!$U:$V,2,FALSE),0)","v":0},{"$f":"IF(ISBLANK(M2),0,IFERROR(VLOOKUP(M2,'Résultat final'!D:L,9,FALSE),0))","v":0}]
["FOURNIER","SYLVIE","F","1960-11-20",51,{"$f":"IF(ISBLANK($A3),\"\",IF(ISERROR(DATEDIF($D3,saison,\"yd\")),\"\",(DATEDIF($D3,saison,\"yd\"))))","v":285},221849,"MUSCULATION HAUBOURDINOISE",{"$f":"IF(A3=\"\",\"\",VLOOKUP(H3,Clubs!A:B,2,FALSE))","v":"NORD PAS DE CALAIS"},59.1,"VETERAN","FV",20,{"$f":"IFERROR(VLOOKUP((P3&L3),'Résultat final'!A:B,2,FALSE),\"\")","v":2},0,"FOURNIER  SYLVIE",{"$f":"IFERROR(HLOOKUP(L3,Juges!$1:$22,22,FALSE),\"\")","v":"N"},{"$f":"+IF(OR(LEFT($Q3,1)=\"I\",LEFT($Q3,1)=\"R\"),VLOOKUP($Q3,'Paramétrage des points'!$U:$V,2,FALSE),0)","v":0},{"$f":"IF(ISBLANK(M3),0,IFERROR(VLOOKUP(M3,'Résultat final'!D:L,9,FALSE),0))","v":0}]
["OUSFANE","MOHAMED","F","1963-06-01",49,{"$f":"IF(ISBLANK(A4),\"\",IF(ISERROR(DATEDIF(D4,saison,\"y\")),\"\",(DATEDIF(D4,saison,\"y\"))))","v":49},292237,"PSA ACC CHARLEVILLE MEZIERES",{"$f":"IF(A4=\"\",\"\",VLOOKUP(H4,Clubs!A:B,2,FALSE))","v":"CHAMPAGNE ARDENNES"},72,"VETERAN","CULTURIS FORM",27,{"$f":"IFERROR(VLOOKUP((P4&L4),'Résultat final'!A:B,2,FALSE),\"\")","v":6},0,"OUSFANE  MOHAMED",{"$f":"IFERROR(HLOOKUP(L4,Juges!$1:$22,22,FALSE),\"\")","v":"NCUF"},{"$f":"+IF(OR(LEFT($Q4,1)=\"I\",LEFT($Q4,1)=\"R\"),VLOOKUP($Q4,'Paramétrage des points'!$U:$V,2,FALSE),0)","v":0},{"$f":"IF(ISBLANK(M4),0,IFERROR(VLOOKUP(M4,'Résultat final'!D:L,9,FALSE),0))","v":0}]
["BRONGNIART","SEBASTIEN","H","1983-03-01",29,{"$f":"DATEDIF(D5,saison,\"yd\")","v":184},311318,"FIT BODY HOUDINOIS",{"$f":"IF(A5=\"\",\"\",VLOOKUP(H5,Clubs!A:B,2,FALSE))","v":"NORD PAS DE CALAIS"},85,"SENIOR",null,55,{"$f":"IFERROR(VLOOKUP((P5&L5),'Résultat final'!A:B,2,FALSE),\"\")","v":""},0,"BRONGNIART  SEBASTIEN",{"$f":"IFERROR(HLOOKUP(L5,Juges!$1:$22,22,FALSE),\"\")","v":""},{"$f":"+IF(OR(LEFT($Q5,1)=\"I\",LEFT($Q5,1)=\"R\"),VLOOKUP($Q5,'Paramétrage des points'!$U:$V,2,FALSE),0)","v":0},{"$f":"IF(ISBLANK(M5),0,IFERROR(VLOOKUP(M5,'Résultat final'!D:L,9,FALSE),0))","v":0}]
["MIAN","Léonard","H","1967-02-09",45,{"$f":"IF(ISBLANK(A6),\"\",IF(ISERROR(DATEDIF(D6,saison,\"y\")),\"\",(DATEDIF(D6,saison,\"y\"))))","v":45},154855,"EVA FITNESS EMERAINVILLE",{"$f":"IF(A6=\"\",\"\",VLOOKUP(H6,Clubs!A:B,2,FALSE))","v":"ILE DE FRANCE"},85,"VET1",null,32,{"$f":"IFERROR(VLOOKUP((P6&L6),'Résultat final'!A:B,2,FALSE),\"\")","v":""},0,"MIAN  Léonard",{"$f":"IFERROR(HLOOKUP(L6,Juges!$1:$22,22,FALSE),\"\")","v":""},{"$f":"+IF(OR(LEFT($Q6,1)=\"I\",LEFT($Q6,1)=\"R\"),VLOOKUP($Q6,'Paramétrage des points'!$U:$V,2,FALSE),0)","v":0},{"$f":"IF(ISBLANK(M6),0,IFERROR(VLOOKUP(M6,'Résultat final'!D:L,9,FALSE),0))","v":0}]
["SIANGA-EYAP","Janvier","H","1977-01-15",35,{"$f":"IF(ISBLANK(A7),\"\",IF(ISERROR(DATEDIF(D7,saison,\"y\")),\"\",(DATEDIF(D7,saison,\"y\"))))","v":35},268322,"ASCAP - POISSY",{"$f":"IF(A7=\"\",\"\",VLOOKUP(H7,Clubs!A:B,2,FALSE))","v":"ILE DE FRANCE"},"113.70","SENIOR",null,62,{"$f":"IFERROR(VLOOKUP((P7&L7),'Résultat final'!A:B,2,FALSE),\"\")","v":""},0,"SIANGA-EYAP  Janvier",{"$f":"IFERROR(HLOOKUP(L7,Juges!$1:$22,22,FALSE),\"\")","v":""},{"$f":"+IF(OR(LEFT($Q7,1)=\"I\",LEFT($Q7,1)=\"R\"),VLOOKUP($Q7,'Paramétrage des points'!$U:$V,2,FALSE),0)","v":0},{"$f":"IF(ISBLANK(M7),0,IFERROR(VLOOKUP(M7,'Résultat final'!D:L,9,FALSE),0))","v":0}]
["DURET","Céline","F","1980-02-22",32,{"$f":"IF(ISBLANK(A8),\"\",IF(ISERROR(DATEDIF(D8,saison,\"y\")),\"\",(DATEDIF(D8,saison,\"y\"))))","v":32},317004,"EVA FITNESS EMERAINVILLE",{"$f":"IF(A8=\"\",\"\",VLOOKUP(H8,Clubs!A:B,2,FALSE))","v":"ILE DE FRANCE"},"46.55","SENIOR",null,49,{"$f":"IFERROR(VLOOKUP((P8&L8),'Résultat final'!A:B,2,FALSE),\"\")","v":""},0,"DURET  Céline",{"$f":"IFERROR(HLOOKUP(L8,Juges!$1:$22,22,FALSE),\"\")","v":""},{"$f":"+IF(OR(LEFT($Q8,1)=\"I\",LEFT($Q8,1)=\"R\"),VLOOKUP($Q8,'Paramétrage des points'!$U:$V,2,FALSE),0)","v":0},{"$f":"IF(ISBLANK(M8),0,IFERROR(VLOOKUP(M8,'Résultat final'!D:L,9,FALSE),0))","v":0}]
["MONCOURTOIS","CHRISTELLE","F","1960-11-20",51,{"$f":"IF(ISBLANK($A9),\"\",IF(ISERROR(DATEDIF($D9,saison,\"yd\")),\"\",(DATEDIF($D9,saison,\"yd\"))))","v":285},141090,"ASC MUSCLE GYM SOISSONS",{"$f":"IF(A9=\"\",\"\",VLOOKUP(H9,Clubs!A:B,2,FALSE))","v":"PICARDIE"},"51.80","VETERAN","FV",33,{"$f":"IFERROR(VLOOKUP((P9&L9),'Résultat final'!A:B,2,FALSE),\"\")","v":5},0,"MONCOURTOIS  CHRISTELLE",{"$f":"IFERROR(HLOOKUP(L9,Juges!$1:$22,22,FALSE),\"\")","v":"N"},{"$f":"+IF(OR(LEFT($Q9,1)=\"I\",LEFT($Q9,1)=\"R\"),VLOOKUP($Q9,'Paramétrage des points'!$U:$V,2,FALSE),0)","v":0},{"$f":"IF(ISBLANK(M9),0,IFERROR(VLOOKUP(M9,'Résultat final'!D:L,9,FALSE),0))","v":0}]
["HECTOR","LAURENCE","H","1988-11-20",23,285,241883,"CP MEDIOLANAISE",{"$f":"IF(A10=\"\",\"\",VLOOKUP(H10,Clubs!A:B,2,FALSE))","v":"NORD PAS DE CALAIS"},"55.55","SENIOR","C2",16,{"$f":"IFERROR(VLOOKUP((P10&L10),'Résultat final'!A:B,2,FALSE),\"\")","v":""},0,"HECTOR  LAURENCE",{"$f":"IFERROR(HLOOKUP(L10,Juges!$1:$22,22,FALSE),\"\")","v":"N"},{"$f":"+IF(OR(LEFT($Q10,1)=\"I\",LEFT($Q10,1)=\"R\"),VLOOKUP($Q10,'Paramétrage des points'!$U:$V,2,FALSE),0)","v":0},{"$f":"IF(ISBLANK(M10),0,IFERROR(VLOOKUP(M10,'Résultat final'!D:L,9,FALSE),0))","v":0}]
{"$rows_left_out":192}
{"sheet":"pesée","index":6,"n_rows":12,"n_cols":8,"rows_kept":12,"cut":false,"hidden":false,"merged":[[0,0,0,7],[1,0,1,7],[3,0,3,7]]}
["FEDERATION FRANCAISE D'HALTEROPHILIE,"]
["MUSCULATION, FORCE ATHLETIQUE ET CULTURISME"]
[]
[" DISCIPLINE  CULTURISME"]
[]
["COMPETITION     ",{"$f":"+Parametres!B3","v":"Compétition magnifique"},null,null,"LIEU    ",null,{"$f":"+Parametres!B9","v":"Gymnase c'est ici"}]
[]
["DATE    ",{"$f":"+dateco","v":"2013-03-13"},null,null,"CATEGORIE",null,"FV"]
[null,null,null,null,{"$f":"G8","v":"FV"}]
["NOM","PRENOM","DATE-NAISSANCE","N° LICENCE","CLUB","COMITE","N° DOSSARD","POIDS"]
{"$rows_left_out":3}
{"sheet":"FV","index":7,"n_rows":30,"n_cols":20,"rows_kept":30,"cut":false,"hidden":false,"merged":[[7,2,7,7],[7,11,7,12]]}
[null,"FEDERATION FRANCAISE D'HALTEROPHILIE,"]
[null,"MUSCULATION, FORCE ATHLETIQUE ET CULTURISME"]
[]
[null," DISCIPLINE  CULTURISME"]
[null,null,2,2,2,2,2,0,0,0,0]
[null,"COMPETITION  :","Compétition magnifique",null,null,null,null,null,null,null,"LIEU : ","Gymnase c'est ici"]
[]
[null,"Date : ","2013-03-13",null,null,null,null,null,null,null,"Catégorie : ","FV",null,null,null,"N",null,null,null,5]
["Juges!I1:I15",0,0,0]
[2,null,2,2,2,2,2,0,0,0,0,2,null,null,null,null,null,null,null,9]
{"$rows_left_out":21}
{"sheet":"notes juge","index":8,"n_rows":145,"n_cols":10,"rows_kept":145,"cut":false,"hidden":false,"merged":[]}
[]
[null,"Compétition :",{"$f":"résultat!C6","v":"Compétition magnifique"},null,null,null,null,null,"Compétition :",{"$f":"C2","v":"Compétition magnifique"}]
[]
[null,"Date :",{"$f":"résultat!C8","v":"2013-03-13"},null,null,null,null,null,"Date :",{"$f":"C4","v":"2013-03-13"}]
[]
[null,"Juge","N° 1",null,null,null,null,null,"Juge","N° 2"]
[null,{"$f":"résultat!C13","v":"GG"},null,null,null,null,null,null,{"$f":"résultat!D13","v":"FF"}]
[null,"Juge :",null,null,null,null,null,null,"Juge :"]
[]
[null,"Catégorie :",{"$f":"résultat!L8","v":"FV"},null,null,null,null,null,"Catégorie :",{"$f":"C10","v":"FV"}]
{"$rows_left_out":136}
{"sheet":"résultat","index":9,"n_rows":30,"n_cols":20,"rows_kept":30,"cut":false,"hidden":false,"merged":[[7,11,7,12],[7,2,7,7]]}
[null,{"$f":"pesée!A1","v":"FEDERATION FRANCAISE D'HALTEROPHILIE,"}]
[null,{"$f":"pesée!A2","v":"MUSCULATION, FORCE ATHLETIQUE ET CULTURISME"}]
[]
[null,{"$f":"pesée!A4","v":" DISCIPLINE  CULTURISME"}]
[null,null,{"$f":"MAX(C14:C28)","v":0},{"$f":"MAX(D14:D28)","v":0},0,0,0,0,0,0,0]
[null,"COMPETITION  :",{"$f":"pesée!$B$6","v":"Compétition magnifique"},null,null,null,null,null,null,null,"LIEU : ",{"$f":"pesée!G6","v":"Gymnase c'est ici"}]
[]
[null,"Date : ",{"$f":"pesée!$B$8","v":"2013-03-13"},null,null,null,null,null,null,null,"Catégorie : ",{"$f":"pesée!$G$8","v":"FV"},null,null,null,{"$f":"Parametres!C5","v":"N"},null,null,null,{"$f":"AVERAGEIF(T14:T28,\">0\")","v":{"$error":"#DIV/0!"}}]
[{"$f":"IF(L8=Juges!B1,\"Juges!B1:B15\",IF(L8=Juges!C1,\"Juges!C1:C15\",IF(L8=Juges!D1,\"Juges!D1:D15\",IF(L8=Juges!E1,\"Juges!E1:E15\",IF(L8=Juges!F1,\"Juges!F1:F15\",IF(L8=Juges!G1,\"Juges!G1:G15\",IF(L8=Juges!H1,\"Juges!H1:H15\",IF(L8=Juges!I1,\"Juges!I1:I15\",B9))))))))","v":"Juges!I1:I15"},{"$f":"IF(L8=Juges!J1,\"Juges!J1:J15\",IF(L8=Juges!K1,\"Juges!k1:K15\",IF(L8=Juges!L1,\"Juges!L1:L15\",IF(L8=Juges!M1,\"Juges!M1:M15\",IF(L8=Juges!N1,\"Juges!N1:N15\",IF(L8=Juges!O1,\"Juges!O1:O15\",IF(L8=Juges!P1,\"Juges!P1:P15\",IF(L8=Juges!Q1,\"Juges!Q1:Q15\",C9))))))))","v":0},{"$f":"IF(L8=Juges!R1,\"Juges!R1:R15\",IF(L8=Juges!S1,\"Juges!S1:S15\",IF(L8=Juges!T1,\"Juges!T1:T15\",IF(L8=Juges!U1,\"Juges!U1:U15\",IF(L8=Juges!V1,\"Juges!V1:V15\",IF(L8=Juges!W1,\"Juges!W1:W15\",IF(L8=Juges!X1,\"Juges!X1:X15\",IF(L8=Juges!Y1,\"Juges!y1:y15\",D9))))))))","v":0},{"$f":"IF(L8=Juges!Z1,\"Juges!z1:z15\",IF(L8=Juges!AA1,\"Juges!aa1:aa15\",IF(L8=Juges!AB1,\"Juges!ab1:ab15\",IF(L8=Juges!AC1,\"Juges!ac1:ac15\",IF(L8=Juges!AD1,\"Juges!ad1:ad15\",IF(L8=Juges!AE1,\"Juges!ae1:ae15\",))))))","v":0}]
[{"$f":"COUNTIF(A14:A28,\">0\")","v":2},null,{"$f":"COUNTA(C14:C28)","v":0},{"$f":"COUNTA(D14:D28)","v":0},0,0,0,0,0,0,{"$f":"COUNTA(K14:K28)","v":0},{"$f":"COUNTIF(L14:L28,\">0\")","v":0},null,null,null,null,null,null,null,{"$f":"COUNT(C10:K10)","v":9}]
{"$rows_left_out":21}
{"sheet":"résultat culturis form","index":10,"n_rows":30,"n_cols":50,"rows_kept":30,"cut":false,"hidden":false,"merged":[[7,2,7,12],[7,20,7,21],[11,2,11,3],[11,4,11,5],[11,6,11,7],[11,8,11,9],[11,10,11,11],[11,12,11,13],[11,14,11,15],[11,16,11,17],[11,18,11,19],[12,12,12,13],[12,14,12,15],[12,16,12,17],[12,18,12,19],[12,2,12,3],[12,4,12,5],[12,6,12,7],[12,8,12,9],[12,10,12,11]]}
[null,{"$f":"pesée!A1","v":"FEDERATION FRANCAISE D'HALTEROPHILIE,"}]
[null,{"$f":"pesée!A2","v":"MUSCULATION, FORCE ATHLETIQUE ET CULTURISME"}]
[]
[null,{"$f":"pesée!A4","v":" DISCIPLINE  CULTURISME"}]
[null,null,{"$f":"MAX(C14:C28)","v":0},{"$f":"MAX(D14:D28)","v":0},0,0,0,0,0,0,0,0,0,0,0,0,0,0,0,0]
[null,"COMPETITION  :",{"$f":"pesée!$B$6","v":"Compétition magnifique"},null,null,null,null,null,null,null,null,null,null,null,null,null,null,null,"LIEU : ",null,{"$f":"pesée!G6","v":"Gymnase c'est ici"}]
[null,null,{"$f":"COUNTIF(C13,\"> \")","v":1},{"$f":"+C7","v":1},{"$f":"COUNTIF(E13,\"> \")","v":1},{"$f":"+E7","v":1},{"$f":"COUNTIF(G13,\"> \")","v":1},{"$f":"+G7","v":1},{"$f":"COUNTIF(I13,\"> \")","v":1},{"$f":"+I7","v":1},{"$f":"COUNTIF(K13,\"> \")","v":1},{"$f":"+K7","v":1},{"$f":"COUNTIF(M13,\"> \")","v":0},{"$f":"+M7","v":0},{"$f":"COUNTIF(O13,\"> \")","v":0},{"$f":"+O7","v":0},{"$f":"COUNTIF(Q13,\"> \")","v":0},{"$f":"+Q7","v":0},{"$f":"COUNTIF(S13,\"> \")","v":0},{"$f":"+S7","v":0}]
[null,"Date : ",{"$f":"pesée!$B$8","v":"2013-03-13"},null,null,null,null,null,null,null,null,null,null,null,null,null,null,null,"Catégorie : ",null,{"$f":"pesée!$G$8","v":"FV"},null,null,{"$f":"Parametres!C5","v":"N"},null,null,null,null,null,null,null,null,null,null,null,null,null,null,null,null,null,null,null,null,null,null,null,null,null,{"$f":"AVERAGEIF(AX14:AX28,\">0\")","v":{"$error":"#DIV/0!"}}]
[{"$f":"IF(U8=Juges!B1,\"Juges!B1:B15\",IF(U8=Juges!C1,\"Juges!C1:C15\",IF(U8=Juges!D1,\"Juges!D1:D15\",IF(U8=Juges!E1,\"Juges!E1:E15\",IF(U8=Juges!F1,\"Juges!F1:F15\",IF(U8=Juges!G1,\"Juges!G1:G15\",IF(U8=Juges!H1,\"Juges!H1:H15\",IF(U8=Juges!I1,\"Juges!I1:I15\",B9))))))))","v":"Juges!I1:I15"},{"$f":"IF(U8=Juges!J1,\"Juges!J1:J15\",IF(U8=Juges!K1,\"Juges!k1:K15\",IF(U8=Juges!L1,\"Juges!L1:L15\",IF(U8=Juges!M1,\"Juges!M1:M15\",IF(U8=Juges!N1,\"Juges!N1:N15\",IF(U8=Juges!O1,\"Juges!O1:O15\",IF(U8=Juges!P1,\"Juges!P1:P15\",IF(U8=Juges!Q1,\"Juges!Q1:Q15\",C9))))))))","v":0},{"$f":"IF(U8=Juges!R1,\"Juges!R1:R15\",IF(U8=Juges!S1,\"Juges!S1:S15\",IF(U8=Juges!T1,\"Juges!T1:T15\",IF(U8=Juges!U1,\"Juges!U1:U15\",IF(U8=Juges!V1,\"Juges!V1:V15\",IF(U8=Juges!W1,\"Juges!W1:W15\",IF(U8=Juges!X1,\"Juges!X1:X15\",IF(U8=Juges!Y1,\"Juges!y1:y15\",D9))))))))","v":0},{"$f":"IF(U8=Juges!Z1,\"Juges!z1:z15\",IF(U8=Juges!AA1,\"Juges!aa1:aa15\",IF(U8=Juges!AB1,\"Juges!ab1:ab15\",IF(U8=Juges!AC1,\"Juges!ac1:ac15\",IF(U8=Juges!AD1,\"Juges!ad1:ad15\",IF(U8=Juges!AE1,\"Juges!ae1:ae15\",))))))","v":0}]
[{"$f":"COUNTIF(A14:A28,\">0\")","v":2},null,{"$f":"COUNTA(C14:C28)","v":0},{"$f":"COUNTA(D14:D28)","v":0},0,0,0,0,0,0,{"$f":"COUNTA(K14:K28)","v":0},{"$f":"COUNTA(L14:L28)","v":0},0,0,0,0,0,0,0,0,{"$f":"COUNTIF(U14:U28,\">0\")","v":0},null,null,null,null,null,null,null,null,null,null,null,null,null,null,null,null,null,null,null,null,null,null,null,null,null,null,null,null,{"$f":"COUNT(C10:T10)/2","v":9}]
{"$rows_left_out":21}
{"sheet":"C3","index":11,"n_rows":30,"n_cols":20,"rows_kept":30,"cut":false,"hidden":false,"merged":[[7,2,7,7],[7,11,7,12]]}
[null,"FEDERATION FRANCAISE D'HALTEROPHILIE,"]
[null,"MUSCULATION, FORCE ATHLETIQUE ET CULTURISME"]
[]
[null," DISCIPLINE  CULTURISME"]
[null,null,7,7,7,0,0,0,0,0,0]
[null,"COMPETITION  :","Compétition magnifique",null,null,null,null,null,null,null,"LIEU : ","Gymnase c'est ici"]
[]
[null,"Date : ","2013-03-13",null,null,null,null,null,null,null,"Catégorie : ","C3",null,null,null,"N",null,null,null,3]
["Juges!D1:D15",0,0,0]
[7,null,7,7,7,0,0,0,0,0,0,7,null,null,null,null,null,null,null,9]
{"$rows_left_out":21}
{"sheet":"CULTURIS FORM","index":12,"n_rows":30,"n_cols":50,"rows_kept":30,"cut":false,"hidden":false,"merged":[[7,2,7,12],[7,20,7,21],[11,2,11,3],[11,4,11,5],[11,6,11,7],[11,8,11,9],[11,10,11,11],[11,12,11,13],[11,14,11,15],[11,16,11,17],[11,18,11,19],[12,2,12,3],[12,4,12,5],[12,6,12,7],[12,8,12,9],[12,10,12,11],[12,12,12,13],[12,14,12,15],[12,16,12,17],[12,18,12,19]]}
[null,"FEDERATION FRANCAISE D'HALTEROPHILIE,"]
[null,"MUSCULATION, FORCE ATHLETIQUE ET CULTURISME"]
[]
[null," DISCIPLINE  CULTURISME"]
[null,null,6,6,6,6,6,6,6,6,6,6,6,6,6,6,0,0,0,0]
[null,"COMPETITION  :","Compétition magnifique",null,null,null,null,null,null,null,null,null,null,null,null,null,null,null,"LIEU : ",null,"Gymnase c'est ici"]
[null,null,1,1,1,1,1,1,1,1,1,1,1,1,1,1,0,0,0,0]
[null,"Date : ","2013-03-13",null,null,null,null,null,null,null,null,null,null,null,null,null,null,null,"Catégorie : ",null,"CULTURIS FORM",null,null,"N",null,null,null,null,null,null,null,null,null,null,null,null,null,null,null,null,null,null,null,null,null,null,null,null,null,14]
["Juges!G1:G15",0,0,0]
[6,null,6,6,6,6,6,6,6,6,6,6,6,6,6,6,0,0,0,0,6,null,null,null,null,null,null,null,null,null,null,null,null,null,null,null,null,null,null,null,null,null,null,null,null,null,null,null,null,9]
{"$rows_left_out":21}
{"sheet":"Couples","index":13,"n_rows":30,"n_cols":20,"rows_kept":30,"cut":false,"hidden":false,"merged":[[7,2,7,7],[7,11,7,12]]}
[null,"FEDERATION FRANCAISE D'HALTEROPHILIE,"]
[null,"MUSCULATION, FORCE ATHLETIQUE ET CULTURISME"]
[]
[null," DISCIPLINE  CULTURISME"]
[null,null,1,1,2,2,2,2,2,2,2]
[null,"COMPETITION  :","Compétition magnifique",null,null,null,null,null,null,null,"LIEU : ","Gymnase c'est ici"]
[]
[null,"Date : ","2013-03-13",null,null,null,null,null,null,null,"Catégorie : ","Couples",null,null,null,"N",null,null,null,9]
["Juges!H1:H15",0,0,0]
[2,null,2,2,2,2,2,2,2,2,2,2,null,null,null,null,null,null,null,9]
{"$rows_left_out":21}
{"sheet":"Résultat final","index":14,"n_rows":544,"n_cols":12,"rows_kept":544,"cut":false,"hidden":false,"merged":[[509,1,509,5],[401,1,401,5],[203,1,203,5],[275,1,275,5],[293,1,293,5],[311,1,311,5],[257,1,257,5],[0,0,0,6],[527,1,527,5],[419,1,419,5],[437,1,437,5],[455,1,455,5],[473,1,473,5],[491,1,491,5],[329,1,329,5],[347,1,347,5],[95,1,95,5],[5,1,5,5],[365,1,365,5],[383,1,383,5],[23,1,23,5],[221,1,221,5],[239,1,239,5],[1,0,1,6],[3,0,3,6],[185,1,185,5],[77,1,77,5],[59,1,59,5],[41,1,41,5],[167,1,167,5],[149,1,149,5],[131,1,131,5],[113,1,113,5]]}
["FEDERATION FRANCAISE D'HALTEROPHILIE,"]
["MUSCULATION, FORCE ATHLETIQUE ET CULTURISME"]
[null,null,null,null,null,null,null,null,{"$f":"Parametres!G5","v":"N"}]
[" DISCIPLINE  CULTURISME"]
[]
[{"$f":"C6&G6","v":"C1"},{"$f":"Juges!B1","v":"C1"},null,null,null,null,{"$f":"B6","v":"C1"},null,null,{"$f":"VLOOKUP(B6,'Paramétrage des points'!$A$5:$C$29,3,FALSE)","v":{"$error":"#N/A"}},null,{"$f":"IFERROR(VLOOKUP(K6,'Paramétrage des points'!AA:AB,2,FALSE),0)","v":0}]
["N0M / PRENOMC1","PLACE","N0M / PRENOM","DOSSARD","CLUB","COMITE",{"$f":"+G6","v":"C1"},null,null,{"$f":"J6","v":{"$error":"#N/A"}},null,{"$f":"IFERROR(VLOOKUP(K7,'Paramétrage des points'!AA:AB,2,FALSE),0)","v":0}]
["POTEAU  ALEXANDREC1",{"$f":"1","v":1},"POTEAU  ALEXANDRE",5,null,null,{"$f":"+G7","v":"C1"},null,null,{"$f":"J7","v":{"$error":"#N/A"}},{"$f":"IF($I$3=\"N\",\"N\"&J8&B8,\"\")","v":{"$error":"#N/A"}},{"$f":"IFERROR(VLOOKUP(K8,'Paramétrage des points'!AA:AB,2,FALSE),0)","v":0}]
["MACHOME  DIDIERC1",2,"MACHOME  DIDIER",6,null,null,{"$f":"+G8","v":"C1"},null,null,{"$error":"#N/A"},{"$error":"#N/A"},{"$f":"IFERROR(VLOOKUP(K9,'Paramétrage des points'!AA:AB,2,FALSE),0)","v":0}]
["C1",3,null,null,null,null,{"$f":"+G9","v":"C1"},null,null,{"$error":"#N/A"},{"$error":"#N/A"},{"$f":"IFERROR(VLOOKUP(K10,'Paramétrage des points'!AA:AB,2,FALSE),0)","v":0}]
{"$rows_left_out":535}
{"sheet":"Résultats clubs","index":15,"n_rows":50,"n_cols":4,"rows_kept":50,"cut":false,"hidden":false,"merged":[[12,1,12,3]]}
[null,{"$f":"pesée!A1","v":"FEDERATION FRANCAISE D'HALTEROPHILIE,"}]
[null,{"$f":"pesée!A2","v":"MUSCULATION, FORCE ATHLETIQUE ET CULTURISME"}]
[]
[null,{"$f":"pesée!A4","v":" DISCIPLINE  CULTURISME"}]
[]
[]
[null,"Compétition : ",{"$f":"pesée!$B$6","v":"Compétition magnifique"}]
[null,"Date : ",{"$f":"pesée!$B$8","v":"2013-03-13"}]
[null,"Lieu : ",{"$f":"+pesée!G6","v":"Gymnase c'est ici"}]
[]
{"$rows_left_out":41}
{"sheet":"comparaison","index":16,"n_rows":32,"n_cols":8,"rows_kept":32,"cut":false,"hidden":false,"merged":[[0,0,2,0],[0,1,0,2],[0,5,2,5],[0,6,0,7],[1,1,1,2],[1,6,1,7],[2,1,2,2],[2,6,2,7],[3,1,3,2],[3,6,3,7],[4,0,4,2],[4,5,4,7],[6,0,6,1],[6,5,6,6],[7,0,7,2],[7,5,7,7],[8,0,8,2],[8,5,8,7],[13,0,13,2],[13,5,13,7],[17,0,19,0],[17,1,17,2],[17,5,19,5],[17,6,17,7],[18,1,18,2],[18,6,18,7],[19,1,19,2],[19,6,19,7],[20,1,20,2],[20,6,20,7],[21,0,21,2],[21,5,21,7],[25,0,25,2],[25,5,25,7],[23,0,23,1],[23,5,23,6],[24,0,24,2],[24,5,24,7]]}
[]
[]
[]
[]
["DEMANDE DE COMPARAISONS",null,null,null,null,"DEMANDE DE COMPARAISONS"]
[]
["NOM",null,"PRENOM",null,null,"NOM",null,"PRENOM"]
[]
["JUGE N°",null,null,null,null,"JUGE N°"]
[]
{"$rows_left_out":22}